Target
Dopamine beta-hydroxylase
Ligand
BDBM50017828
Substrate
Meas. Tech.
ChEBML_59142
Ki
3200000±n/a nM
Citation
 Farrington, GKKumar, AVillafranca, JJ Benzofurans as mechanism-based inhibitors of dopamine beta-hydroxylase. J Med Chem 32:735-7 (1989)  
Target
Name:
Dopamine beta-hydroxylase
Synonyms:
DBH | DOPO_BOVIN
Type:
PROTEIN
Mol. Mass.:
68136.39
Organism:
Bos taurus
Description:
ChEMBL_50738
Residue:
610
  
Inhibitor
Name:
BDBM50017828
Synonyms:
Benzofuran-7-ol | CHEMBL351411
Type:
Small organic molecule
Emp. Form.:
C8H6O2
Mol. Mass.:
134.132
SMILES:
Oc1cccc2ccoc12
: