Target
Dopamine beta-hydroxylase
Ligand
BDBM50017834
Substrate
Meas. Tech.
ChEBML_59142
Ki
57000.0±n/a nM
Citation
 Farrington, GKKumar, AVillafranca, JJ Benzofurans as mechanism-based inhibitors of dopamine beta-hydroxylase. J Med Chem 32:735-7 (1989)  
Target
Name:
Dopamine beta-hydroxylase
Synonyms:
DBH | DOPO_BOVIN
Type:
PROTEIN
Mol. Mass.:
68136.39
Organism:
Bos taurus
Description:
ChEMBL_50738
Residue:
610
  
Inhibitor
Name:
BDBM50017834
Synonyms:
4-(1-Aminomethyl-prop-2-ynyl)-phenol | CHEMBL163120
Type:
Small organic molecule
Emp. Form.:
C10H11NO
Mol. Mass.:
161.2004
SMILES:
NCC(C#C)c1ccc(O)cc1
: