Target
Excitatory amino acid transporter 2
Ligand
BDBM50327884
Substrate
Meas. Tech.
ChEMBL_1735431 (CHEMBL4150967)
IC50
10.0±n/a nM
Citation
 Fu, HZhang, JTepper, PGBunch, LJensen, AAPoelarends, GJ Chemoenzymatic Synthesis and Pharmacological Characterization of Functionalized Aspartate Analogues As Novel Excitatory Amino Acid Transporter Inhibitors. J Med Chem 61:7741-7753 (2018)  
Target
Name:
Excitatory amino acid transporter 2
Synonyms:
EAA2_HUMAN GLT1 SLC1A2 Solute carrier family 1 member 2
Type:
Enzyme Catalytic Domain
Mol. Mass.:
62103.57
Organism:
Homo sapiens (Human)
Description:
Excitatory Amino Acid EAAT2 0 0::P43004
Residue:
574
  
Inhibitor
Name:
BDBM50327884
Synonyms:
(2S,3S)-2-amino-3-(3-(4-(trifluoromethyl)benzamido)benzyloxy)succinic acid | CHEMBL1257519
Type:
Small organic molecule
Emp. Form.:
C19H17F3N2O6
Mol. Mass.:
426.3433
SMILES:
N[C@@H]([C@H](OCc1cccc(NC(=O)c2ccc(cc2)C(F)(F)F)c1)C(O)=O)C(O)=O
: