Target
Phospholipase A2 group V
Ligand
BDBM50055366
Substrate
Meas. Tech.
ChEMBL_1735581 (CHEMBL4151117)
IC50
124±n/a nM
Citation
 Knerr, LGiordanetto, FNordberg, PPettersen, DSelmi, NBeisel, HGde la Motte, HOlsson, TPerkins, TDJHerslöf, MMånsson, ÅDahlström, MStarke, IBroddefalk, JSaarinen, GKlingegård, FHurt-Camejo, ERosengren, BBrengdahl, JJansen, FRohman, MSandmark, JHallberg, KÅkerud, TRoth, RGAhlqvist, M Discovery of a Series of Indole-2 Carboxamides as Selective Secreted Phospholipase A ACS Med Chem Lett 9:594-599 (2018)  
Target
Name:
Phospholipase A2 group V
Synonyms:
PA2G5_HUMAN Phospholipase A2 group V | Secretory phospholipase A2, group V (sPLA2-V)
Type:
Protein
Mol. Mass.:
15682.61
Organism:
Homo sapiens (Human)
Description:
Residue:
138
  
Inhibitor
Name:
BDBM50055366
Synonyms:
(3-Aminooxalyl-1-benzyl-2-ethyl-1H-indol-4-yloxy)-acetic acid 2-(3-(2-amino-2-oxoacetyl)-1-benzyl-2-ethyl-1H-indol-4-yloxy)acetic acid Varespladib sodium
Type:
Small organic molecule
Emp. Form.:
C21H20N2O5
Mol. Mass.:
380.3939
SMILES:
CCc1c(C(=O)C(N)=O)c2c(OCC(O)=O)cccc2n1Cc1ccccc1
: