Target
Carbonic anhydrase 9
Ligand
BDBM50108105
Substrate
Meas. Tech.
ChEMBL_1735712 (CHEMBL4151248)
Ki
>20000±n/a nM
Citation
 Lomelino, CLMurray, ABSupuran, CTMcKenna, R Sweet Binders: Carbonic Anhydrase IX in Complex with Sucralose. ACS Med Chem Lett 9:657-661 (2018)  
Target
Name:
Carbonic anhydrase 9
Synonyms:
CA-IX CAH9_HUMAN Carbonic anhydrase 9 (CA IX) Carbonic anhydrase 9 precursor Carbonic anhydrase IX (CAIX) Carbonic anhydrases; II & IX MN RCC-associated antigen G250
Type:
Enzyme
Mol. Mass.:
49669.03
Organism:
Homo sapiens (Human)
Description:
Catalytic domain of human cloned isozyme was used in the assay
Residue:
459
  
Inhibitor
Name:
BDBM50108105
Synonyms:
CHEBI:17992 | Sucrose
Type:
Small organic molecule
Emp. Form.:
C12H22O11
Mol. Mass.:
342.2965
SMILES:
OC[C@H]1O[C@@](CO)(O[C@H]2O[C@H](CO)[C@@H](O)[C@H](O)[C@H]2O)[C@@H](O)[C@@H]1O
: