Target
Papain
Ligand
BDBM50018173
Substrate
Meas. Tech.
ChEMBL_152651 (CHEMBL763840)
pH
5.5±n/a
Ki
25000±n/a nM
Comments
extracted
Citation
 Silver, MSHaskell, JH Acid-sensitive latent inhibitors for proteolytic enzymes: synthesis and characterization. J Med Chem 32:1253-9 (1989)  
Target
Name:
Papain
Synonyms:
Allergen=Car p 1 PPI | Papaya proteinase I
Type:
Enzyme
Mol. Mass.:
38923.01
Organism:
Carica papaya
Description:
Papain was purchased from Sigma, Germany.
Residue:
345
  
Inhibitor
Name:
BDBM50018173
Synonyms:
CHEMBL22745 | N-{2-[(2-Acetylamino-propionyl)-hydrazono]-ethyl}-benzamide
Type:
Small organic molecule
Emp. Form.:
C14H18N4O3
Mol. Mass.:
290.3177
SMILES:
C[C@H](NC(C)=O)C(=O)NN=CCNC(=O)c1ccccc1
: