Target
Chymotrypsin-C
Ligand
BDBM50018173
Substrate
Meas. Tech.
ChEMBL_49776 (CHEMBL662998)
pH
5±n/a
Ki
>8000000±n/a nM
Comments
extracted
Citation
 Silver, MSHaskell, JH Acid-sensitive latent inhibitors for proteolytic enzymes: synthesis and characterization. J Med Chem 32:1253-9 (1989)  
Target
Name:
Chymotrypsin-C
Synonyms:
CLCR CTRC_HUMAN Chymotrypsin Chymotrypsin-C
Type:
Enzyme
Mol. Mass.:
29487.98
Organism:
Homo sapiens (Human)
Description:
Q99895
Residue:
268
  
Inhibitor
Name:
BDBM50018173
Synonyms:
CHEMBL22745 | N-{2-[(2-Acetylamino-propionyl)-hydrazono]-ethyl}-benzamide
Type:
Small organic molecule
Emp. Form.:
C14H18N4O3
Mol. Mass.:
290.3177
SMILES:
C[C@H](NC(C)=O)C(=O)NN=CCNC(=O)c1ccccc1
: