Target
Dual specificity tyrosine-phosphorylation-regulated kinase 1A
Ligand
BDBM50368985
Substrate
Meas. Tech.
ChEMBL_1736321 (CHEMBL4151857)
IC50
>6000±n/a nM
Citation
 Czarna, AWang, JZelencova, DLiu, YDeng, XChoi, HGZhang, TZhou, WChang, JWKildalsen, HSeternes, OMGray, NSEngh, RARothweiler, U Novel Scaffolds for Dual Specificity Tyrosine-Phosphorylation-Regulated Kinase (DYRK1A) Inhibitors. J Med Chem 61:7560-7572 (2018)  
Target
Name:
Dual specificity tyrosine-phosphorylation-regulated kinase 1A
Synonyms:
DYR1A_HUMAN DYRK1A Dual specificity YAK1-related kinase 1A (Dyrk1A) Dual-specificity tyrosine-phosphorylation regulated kinase 1A HP86 MNBH
Type:
Enzyme
Mol. Mass.:
85616.61
Organism:
Homo sapiens (Human)
Description:
Q13627
Residue:
763
  
Inhibitor
Name:
BDBM50368985
Synonyms:
CHEMBL4167484
Type:
Small organic molecule
Emp. Form.:
C17H15N5O2
Mol. Mass.:
321.3333
SMILES:
COc1ccc(N)cc1-c1cnc(N)c(n1)C(=O)c1cccnc1
: