Target
Stromal cell-derived factor 1
Ligand
BDBM50369286
Substrate
Meas. Tech.
ChEMBL_1736458 (CHEMBL4151994)
Ki
53±n/a nM
Citation
 Regenass, PAbboud, DDaubeuf, FLehalle, CGizzi, PRiché, SHachet-Haas, MRohmer, FGasparik, VBoeglin, DHaiech, JKnehans, TRognan, DHeissler, DMarsol, CVilla, PGalzi, JLHibert, MFrossard, NBonnet, D Discovery of a Locally and Orally Active CXCL12 Neutraligand (LIT-927) with Anti-inflammatory Effect in a Murine Model of Allergic Airway Hypereosinophilia. J Med Chem 61:7671-7686 (2018)  
Target
Name:
Stromal cell-derived factor 1
Synonyms:
CXCL12 SDF1 SDF1B | SDF1_HUMAN
Type:
Enzyme
Mol. Mass.:
10677.83
Organism:
Homo sapiens (Human)
Description:
P48061
Residue:
93
  
Inhibitor
Name:
BDBM50369286
Synonyms:
CHEMBL4167574
Type:
Small organic molecule
Emp. Form.:
C16H12Cl2O3
Mol. Mass.:
323.171
SMILES:
COc1cc(\C=C\C(=O)c2cc(Cl)ccc2Cl)ccc1O
: