Target
Nuclear factor erythroid 2-related factor 2
Ligand
BDBM50130549
Substrate
Meas. Tech.
ChEMBL_1736592 (CHEMBL4152128)
IC50
63±n/a nM
Citation
 Richardson, BGJain, ADPotteti, HRLazzara, PRDavid, BPTamatam, CRChoma, ESkowron, KDye, KSiddiqui, ZWang, YTKrunic, AReddy, SPMoore, TW Replacement of a Naphthalene Scaffold in Kelch-like ECH-Associated Protein 1 (KEAP1)/Nuclear Factor (Erythroid-derived 2)-like 2 (NRF2) Inhibitors. J Med Chem 61:8029-8047 (2018)  
Target
Name:
Nuclear factor erythroid 2-related factor 2
Synonyms:
HEBP1 NF-E2-related factor 2 NFE2-related factor 2 NRF2 Nuclear factor, erythroid derived 2, like 2
Type:
PROTEIN
Mol. Mass.:
67786.89
Organism:
Homo sapiens (Human)
Description:
ChEMBL_107924
Residue:
605
  
Inhibitor
Name:
BDBM50130549
Synonyms:
CHEMBL3632711
Type:
Small organic molecule
Emp. Form.:
C28H28N4O8S2
Mol. Mass.:
612.674
SMILES:
COc1ccc(cc1)S(=O)(=O)N(CC(N)=O)c1ccc(N(CC(N)=O)S(=O)(=O)c2ccc(OC)cc2)c2ccccc12
: