Target
Neprilysin
Ligand
BDBM50018220
Substrate
Meas. Tech.
ChEBML_144458
IC50
2.3±n/a nM
Citation
 Xie, JSoleilhac, JMSchmidt, CPeyroux, JRoques, BPFournié-Zaluski, MC New kelatorphan-related inhibitors of enkephalin metabolism: improved antinociceptive properties. J Med Chem 32:1497-503 (1989)  
Target
Name:
Neprilysin
Synonyms:
Atriopeptidase CD_antigen=CD10 MME NEP_RABIT Neutral endopeptidase 24.11
Type:
Enzyme
Mol. Mass.:
85570.75
Organism:
Oryctolagus cuniculus (rabbit)
Description:
NEP was purified to homogeneity from rabbit kidney.
Residue:
750
  
Inhibitor
Name:
BDBM50018220
Synonyms:
3-(2-Benzyl-3-hydroxycarbamoyl-propionylamino)-2-methyl-propionic acid | CHEMBL37921
Type:
Small organic molecule
Emp. Form.:
C15H20N2O5
Mol. Mass.:
308.3297
SMILES:
CC(CNC(=O)C(CC(=O)NO)Cc1ccccc1)C(O)=O
: