Target
Bromodomain-containing protein 4
Ligand
BDBM50365463
Substrate
Meas. Tech.
ChEMBL_1739119 (CHEMBL4154869)
IC50
631±n/a nM
Citation
 Xue, XZhang, YWang, CZhang, MXiang, QWang, JWang, ALi, CZhang, CZou, LWang, RWu, SLu, YChen, HDing, KLi, GXu, Y Benzoxazinone-containing 3,5-dimethylisoxazole derivatives as BET bromodomain inhibitors for treatment of castration-resistant prostate cancer. Eur J Med Chem 152:542-559 (2018)  
Target
Name:
Bromodomain-containing protein 4
Synonyms:
BRD4 Bromodomain-containing protein 4 (BRD4) Protein HUNK1
Type:
Protein
Mol. Mass.:
152264.84
Organism:
Homo sapiens (Human)
Description:
O60885
Residue:
1362
  
Inhibitor
Name:
BDBM50365463
Synonyms:
CHEMBL1232461
Type:
Small organic molecule
Emp. Form.:
C22H22ClN5O2
Mol. Mass.:
423.895
SMILES:
CCNC(=O)C[C@@H]1N=C(c2ccc(Cl)cc2)c2cc(OC)ccc2-n2c(C)nnc12
: