Target
Cholinesterase
Ligand
BDBM50421747
Substrate
Meas. Tech.
ChEMBL_1739695 (CHEMBL4155445)
IC50
220±n/a nM
Citation
 Ghobadian, RMahdavi, MNadri, HMoradi, AEdraki, NAkbarzadeh, TSharifzadeh, MBukhari, SNAAmini, M Novel tetrahydrocarbazole benzyl pyridine hybrids as potent and selective butryl cholinesterase inhibitors with neuroprotective and ?-secretase inhibition activities. Eur J Med Chem 155:49-60 (2018)  
Target
Name:
Cholinesterase
Synonyms:
BCHE CHLE_HORSE | Cholinesterase
Type:
Enzyme
Mol. Mass.:
65643.35
Organism:
Equus caballus (Horse)
Description:
P81908
Residue:
574
  
Inhibitor
Name:
BDBM50421747
Synonyms:
CHEMBL4171576
Type:
Small organic molecule
Emp. Form.:
C25H24Cl2N2
Mol. Mass.:
423.377
SMILES:
[Cl-].Clc1ccc(C[n+]2cccc(Cn3c4CCCCc4c4ccccc34)c2)cc1
: