Target
Cholinesterase
Ligand
BDBM50422387
Substrate
Meas. Tech.
ChEMBL_1739695 (CHEMBL4155445)
IC50
88±n/a nM
Citation
 Ghobadian, RMahdavi, MNadri, HMoradi, AEdraki, NAkbarzadeh, TSharifzadeh, MBukhari, SNAAmini, M Novel tetrahydrocarbazole benzyl pyridine hybrids as potent and selective butryl cholinesterase inhibitors with neuroprotective and ?-secretase inhibition activities. Eur J Med Chem 155:49-60 (2018)  
Target
Name:
Cholinesterase
Synonyms:
BCHE CHLE_HORSE | Cholinesterase
Type:
Enzyme
Mol. Mass.:
65643.35
Organism:
Equus caballus (Horse)
Description:
P81908
Residue:
574
  
Inhibitor
Name:
BDBM50422387
Synonyms:
CHEMBL4159171
Type:
Small organic molecule
Emp. Form.:
C26H27ClN2
Mol. Mass.:
402.959
SMILES:
[Cl-].Cc1ccc(C[n+]2cccc(Cn3c4CCCCc4c4ccccc34)c2)cc1
: