Target
Carbonic anhydrase 2
Ligand
BDBM50449814
Substrate
Meas. Tech.
ChEMBL_1740759 (CHEMBL4156509)
Kd
0.035000±n/a nM
Citation
 Zak?auskas, A?apkauskait?, EJezep?ikas, LLinkuvien?, VKi?onait?, MSmirnov, AManakova, EGra?ulis, SMatulis, D Design of two-tail compounds with rotationally fixed benzenesulfonamide ring as inhibitors of carbonic anhydrases. Eur J Med Chem 156:61-78 (2018)  
Target
Name:
Carbonic anhydrase 2
Synonyms:
CA-II CAC Carbonate dehydratase II Carbonic anhydrase 2 (CA-II) Carbonic anhydrase C Carbonic anhydrase II (CA-II) Carbonic anhydrase II (hCA II) | Carbonic anhydrase isoenzyme II (hCA II)
Type:
Enzyme
Mol. Mass.:
29250.71
Organism:
Homo sapiens (Human)
Description:
P00918
Residue:
260
  
Inhibitor
Name:
BDBM50449814
Synonyms:
CHEMBL4163518
Type:
Small organic molecule
Emp. Form.:
C18H22ClN3O3S
Mol. Mass.:
395.904
SMILES:
CCCCNC(=O)c1cc(c(Cl)cc1NCc1ccccc1)S(N)(=O)=O
: