Target
Sodium channel protein type 4 subunit alpha
Ligand
BDBM50450583
Substrate
Meas. Tech.
ChEMBL_1742881 (CHEMBL4158631)
IC50
72±n/a nM
Citation
 Wu, BMurray, JKAndrews, KLSham, KLong, JAral, JLigutti, JAmagasu, SLiu, DZou, AMin, XWang, ZIlch, CPKornecook, TJLin, MJBe, XMiranda, LPMoyer, BDBiswas, K Discovery of Tarantula Venom-Derived Na J Med Chem 61:9500-9512 (2018)  
Target
Name:
Sodium channel protein type 4 subunit alpha
Synonyms:
SCN4A SkM1 Sodium channel protein skeletal muscle subunit alpha Sodium channel protein type IV alpha subunit Voltage-gated sodium channel subunit alpha Nav1.4 | Voltage-gated sodium channel subunit alpha Nav1.4 (Nav1.4)
Type:
Protein
Mol. Mass.:
208010.01
Organism:
Homo sapiens (Human)
Description:
P35499
Residue:
1836
  
Inhibitor
Name:
BDBM50450583
Synonyms:
CHEMBL4174312
Type:
Small organic molecule
Emp. Form.:
C157H238BrN47O43S6
Mol. Mass.:
3744.153
SMILES:
CCCC[C@@H]1NC(=O)[C@H](Cc2c[nH]c3ccccc23)NC(=O)[C@H](CCCCN)NC(=O)[C@H](CCC(N)=O)NC(=O)[C@H](CSSC[C@@H]2NC(=O)[C@@H]3CSSC[C@H](NC(=O)[C@H](Cc4c[nH]c5ccc(Br)cc45)NC(=O)[C@H](CC(C)C)NC(=O)[C@H](CCCCN)NC(=O)[C@H](CSSC[C@H](NC(=O)[C@@H](NC(=O)[C@H](Cc4c[nH]c5ccccc45)NC1=O)[C@@H](C)O)C(=O)N[C@@H](CC(O)=O)C(=O)N[C@@H](CO)C(=O)N[C@@H](CCC(O)=O)C(=O)N[C@@H](CCCNC(N)=N)C(=O)N[C@@H](C)C(=O)N3)NC(=O)[C@H](CCCNC(N)=N)NC(=O)[C@H](CC(C)C)NC(=O)CNC(=O)[C@H](CCC(O)=O)NC2=O)C(=O)N[C@@H](CCCNC(N)=N)C(=O)N[C@@H](CCCCN)C(=O)N[C@@H](CCC(O)=O)C(=O)N[C@@H]([C@@H](C)CC)C(N)=O)NC(=O)[C@H](CC#C)NC(=O)[C@@H](N)CCC(O)=O
: