Target
Phosphatidylinositol 4,5-bisphosphate 3-kinase catalytic subunit gamma isoform
Ligand
BDBM50450695
Substrate
Meas. Tech.
ChEMBL_1743028 (CHEMBL4158778)
IC50
0.700000±n/a nM
Citation
 Erra, MTaltavull, JBernal, FJCaturla, JFCarrascal, MPagès, LMir, MEspinosa, SGràcia, JDomínguez, MSabaté, MParis, SMaldonado, MHernández, BBravo, MCalama, EMiralpeix, MLehner, MDCalbet, M Discovery of a Novel Inhaled PI3K? Inhibitor for the Treatment of Respiratory Diseases. J Med Chem 61:9551-9567 (2018)  
Target
Name:
Phosphatidylinositol 4,5-bisphosphate 3-kinase catalytic subunit gamma isoform
Synonyms:
PI3-kinase p110 subunit gamma PI3Kgamma PK3CG_HUMAN Phosphatidylinositol 4,5-bisphosphate 3-kinase (PI3K) Phosphatidylinositol 4,5-bisphosphate 3-kinase catalytic subunit gamma (PI3Kgamma) Phosphatidylinositol 4,5-bisphosphate 3-kinase catalytic subunit gamma isoform (PI3K) Phosphatidylinositol-4,5-bisphosphate 3-kinase catalytic subunit gamma isoform Phosphoinositide 3-kinases gamma (PI3K gamma) p120-PI3K
Type:
Enzyme Subunit
Mol. Mass.:
126470.30
Organism:
Homo sapiens (Human)
Description:
P48736
Residue:
1102
  
Inhibitor
Name:
BDBM50450695
Synonyms:
CHEMBL4176898
Type:
Small organic molecule
Emp. Form.:
C27H23N7O2
Mol. Mass.:
477.5172
SMILES:
C[C@H](Nc1ncnc2[nH]cc(-c3ccc(O)cc3)c12)c1nn2ccc(C)c2c(=O)n1-c1ccccc1
: