Target
Heat shock protein HSP 90-alpha
Ligand
BDBM50087812
Substrate
Meas. Tech.
ChEMBL_1743108 (CHEMBL4158858)
Kd
620±n/a nM
Citation
 Jiang, FGuo, APXu, JCYou, QDXu, XL Discovery of a Potent Grp94 Selective Inhibitor with Anti-Inflammatory Efficacy in a Mouse Model of Ulcerative Colitis. J Med Chem 61:9513-9533 (2018)  
Target
Name:
Heat shock protein HSP 90-alpha
Synonyms:
HS90A_HUMAN HSP86 HSP90AA1 HSPCA Heat shock 86 kDa Heat shock protein HSP 90-alpha (HSP90) LAP-2 Lipopolysaccharide-associated protein 2 heat shock protein 90kDa alpha (cytosolic), class A member 1 isoform 2
Type:
Molecular Chaperone
Mol. Mass.:
84623.45
Organism:
Homo sapiens (Human)
Description:
P07900
Residue:
732
  
Inhibitor
Name:
BDBM50087812
Synonyms:
CHEMBL3426787
Type:
Small organic molecule
Emp. Form.:
C20H19ClN2O4
Mol. Mass.:
386.829
SMILES:
COC(=O)c1c(O)cc(O)c(Cl)c1CCc1nccn1Cc1ccccc1
: