Target
Fatty-acid amide hydrolase 1
Ligand
BDBM50450764
Substrate
Meas. Tech.
ChEMBL_1743262 (CHEMBL4177772)
IC50
9.0±n/a nM
Citation
 Tuo, WLeleu-Chavain, NSpencer, JSansook, SMillet, RChavatte, P Therapeutic Potential of Fatty Acid Amide Hydrolase, Monoacylglycerol Lipase, and N-Acylethanolamine Acid Amidase Inhibitors. J Med Chem 60:4-46 (2017)  
Target
Name:
Fatty-acid amide hydrolase 1
Synonyms:
Anandamide amidohydrolase FAAH1_MOUSE Faah1 Fatty-acid amide hydrolase (FAAH) Oleamide hydrolase 1
Type:
Hydrolase; single-pass membrane protein; homodimer
Mol. Mass.:
63227.28
Organism:
Mus musculus (mouse)
Description:
Mouse brain membranes were used in the assay.
Residue:
579
  
Inhibitor
Name:
BDBM50450764
Synonyms:
CHEMBL4218039
Type:
Small organic molecule
Emp. Form.:
C20H21NO2
Mol. Mass.:
307.3862
SMILES:
C=C(OC(=O)N1CCCCC1)c1ccc(cc1)-c1ccccc1
: