Target
Calcium/calmodulin-dependent protein kinase with a kinase domain and 2 calmodulin-like EF hands
Ligand
BDBM50151363
Substrate
Meas. Tech.
ChEMBL_1743513 (CHEMBL4178023)
IC50
>10000±n/a nM
Citation
 Osman, KTYe, JShi, ZToker, CLovato, DJumani, RSZuercher, WHuston, CDEdwards, AMLautens, MSanthakumar, VHui, R Discovery and structure activity relationship of the first potent cryptosporidium FIKK kinase inhibitor. Bioorg Med Chem 25:1672-1680 (2017)  
Target
Name:
Calcium/calmodulin-dependent protein kinase with a kinase domain and 2 calmodulin-like EF hands
Synonyms:
Calcium/calmodulin-dependent protein kinase with a kinase domain and 2 calmodulin-like EF hands
Type:
PROTEIN
Mol. Mass.:
93057.92
Organism:
Cryptosporidium parvum (strain Iowa II)
Description:
ChEMBL_118090
Residue:
824
  
Inhibitor
Name:
BDBM50151363
Synonyms:
4-(3-Chloro-phenyl)-5-[1,5]naphthyridin-2-yl-thiazol-2-ylamine CHEMBL365663
Type:
Small organic molecule
Emp. Form.:
C17H11ClN4S
Mol. Mass.:
338.814
SMILES:
Nc1nc(c(s1)-c1ccc2ncccc2n1)-c1cccc(Cl)c1
: