Target
17-beta-hydroxysteroid dehydrogenase type 2
Ligand
BDBM9461
Substrate
Meas. Tech.
ChEMBL_1744042 (CHEMBL4178552)
IC50
9900±n/a nM
Citation
 Vuorinen, AEngeli, RTLeugger, SBachmann, FAkram, MAtanasov, AGWaltenberger, BTemml, VStuppner, HKrenn, LAteba, SBNjamen, DDavis, RAOdermatt, ASchuster, D Potential Antiosteoporotic Natural Product Lead Compounds That Inhibit 17?-Hydroxysteroid Dehydrogenase Type 2. J Nat Prod 80:965-974 (2017)  
Target
Name:
17-beta-hydroxysteroid dehydrogenase type 2
Synonyms:
17-beta-Hydroxysteroid Dehydrogenase 2 (17-beta-HSD2) 20-alpha-HSD EDH17B2 Estradiol 17-beta-dehydrogenase 2 (17beta-HSD2) Microsomal 17-beta-hydroxysteroid dehydrogenas Testosterone 17-beta-dehydrogenase
Type:
Oxidoreductase; single-pass type II membrane protein
Mol. Mass.:
42795.29
Organism:
Homo sapiens (Human)
Description:
Enzyme was partially purified from human placenta.
Residue:
387
  
Inhibitor
Name:
BDBM9461
Synonyms:
5,7-dihydroxy-3-(4-methoxyphenyl)-4H-chromen-4-one Biochanin A (BCA) CHEMBL131921 | cid_5280373
Type:
Small organic molecule
Emp. Form.:
C16H12O5
Mol. Mass.:
284.2635
SMILES:
COc1ccc(cc1)-c1coc2cc(O)cc(O)c2c1=O
: