Target
Mu-type opioid receptor
Ligand
BDBM50019053
Substrate
Meas. Tech.
ChEBML_149144
Ki
374.0±n/a nM
Citation
 Gacel, GDaugé, VBreuzé, PDelay-Goyet, PRoques, BP Development of conformationally constrained linear peptides exhibiting a high affinity and pronounced selectivity for delta opioid receptors. J Med Chem 31:1891-7 (1988)  
Target
Name:
Mu-type opioid receptor
Synonyms:
MOR-1 Mu-type opioid receptor (MOR) OPRM_RAT Opioid receptor B Ror-b
Type:
G Protein-Coupled Receptor (GPCR)
Mol. Mass.:
44503.11
Organism:
Rattus norvegicus (rat)
Description:
Competition binding assays were carried out using membrane preparations from transfected HN9.10 cells that constitutively expressed the mu opioid receptor.
Residue:
398
  
Inhibitor
Name:
BDBM50019053
Synonyms:
2-{2-[2-(2-{2-[2-Amino-3-(4-hydroxy-phenyl)-propionylamino]-3-tert-butoxy-propionylamino}-acetylamino)-3-phenyl-propionylamino]-4-methyl-pentanoylamino}-3-hydroxy-butyric acid | CHEMBL298972
Type:
Small organic molecule
Emp. Form.:
C37H54N6O10
Mol. Mass.:
742.8589
SMILES:
CC(C)C[C@H](NC(=O)[C@H](Cc1ccccc1)NC(=O)CNC(=O)[C@@H](COC(C)(C)C)NC(=O)[C@@H](N)Cc1ccc(O)cc1)C(=O)N[C@@H]([C@@H](C)O)C(O)=O
: