Target
Polyprotein P1234
Ligand
BDBM50450957
Substrate
Meas. Tech.
ChEMBL_1744330 (CHEMBL4178840)
EC50
5000±n/a nM
Citation
 da Silva-Júnior, EFLeoncini, GORodrigues, ÉESAquino, TMAraújo-Júnior, JX The medicinal chemistry of Chikungunya virus. Bioorg Med Chem 25:4219-4244 (2017)  
Target
Name:
Polyprotein P1234
Synonyms:
2.1.1.- 2.7.7.19 3.1.3.33 3.4.22.- 3.6.4.13 Non-structural protein 1 Non-structural protein 3 P123 POLN_CHIKS Polyprotein P1234 RNA-directed RNA polymerase nsP4 nsP2 nsP4
Type:
PROTEIN
Mol. Mass.:
275673.04
Organism:
Chikungunya virus (strain S27-African prototype) (CHIKV)
Description:
ChEMBL_117867
Residue:
2474
  
Inhibitor
Name:
BDBM50450957
Synonyms:
CHEMBL3125915
Type:
Small organic molecule
Emp. Form.:
C25H32N2O3
Mol. Mass.:
408.5332
SMILES:
CCOc1ccc(\C=N\NC(=O)C2CC2c2ccc(cc2)C(C)(C)C)cc1OCC
: