Target
5-hydroxytryptamine receptor 2A
Ligand
BDBM50451054
Substrate
Meas. Tech.
ChEMBL_1744657 (CHEMBL4179167)
Ki
74±n/a nM
Target
Name:
5-hydroxytryptamine receptor 2A
Synonyms:
5-HT-2A 5-HT2A 5-hydroxytryptamine receptor 2A (5HT2A) Htr2 Serotonin Receptor 2A
Type:
G Protein-Coupled Receptor (GPCR)
Mol. Mass.:
52852.05
Organism:
Rattus norvegicus (rat)
Description:
Rat cortex membranes 5-HT2A receptors.
Residue:
471
  
Inhibitor
Name:
BDBM50451054
Synonyms:
CHEMBL4208744
Type:
Small organic molecule
Emp. Form.:
C18H20Cl2N4O
Mol. Mass.:
379.284
SMILES:
Clc1ccc(cc1Cl)N1CCN(CCNC(=O)c2ccccn2)CC1
: