Target
5-hydroxytryptamine receptor 2C
Ligand
BDBM50451054
Substrate
Meas. Tech.
ChEMBL_1744658 (CHEMBL4179168)
Ki
>10000±n/a nM
Target
Name:
5-hydroxytryptamine receptor 2C
Synonyms:
5-HT2C 5-hydroxytryptamine receptor 2C (5HT2c) 5ht1c Htr2c Serotonin receptor 2a and 2c (5HT2A and 5HT2C)
Type:
Enzyme
Mol. Mass.:
51935.10
Organism:
Rattus norvegicus (Rat)
Description:
P08909
Residue:
460
  
Inhibitor
Name:
BDBM50451054
Synonyms:
CHEMBL4208744
Type:
Small organic molecule
Emp. Form.:
C18H20Cl2N4O
Mol. Mass.:
379.284
SMILES:
Clc1ccc(cc1Cl)N1CCN(CCNC(=O)c2ccccn2)CC1
: