Target
Cruzipain
Ligand
BDBM50451631
Substrate
Meas. Tech.
ChEMBL_1745981 (CHEMBL4180491)
Ki
1.6±n/a nM
Citation
 Silva, DGRibeiro, JFRDe Vita, DCianni, LFranco, CHFreitas-Junior, LHMoraes, CBRocha, JRBurtoloso, ACBKenny, PWLeitão, AMontanari, CA A comparative study of warheads for design of cysteine protease inhibitors. Bioorg Med Chem Lett 27:5031-5035 (2017)  
Target
Name:
Cruzipain
Synonyms:
CYSP_TRYCR Cruzaine | Major cysteine proteinase
Type:
Protein
Mol. Mass.:
49831.41
Organism:
Trypanosoma cruzi
Description:
P25779
Residue:
467
  
Inhibitor
Name:
BDBM50451631
Synonyms:
CHEMBL4212454
Type:
Small organic molecule
Emp. Form.:
C21H28N6O2
Mol. Mass.:
396.486
SMILES:
CN(C#N)N(C)C(=O)[C@H](Cc1ccccc1)NC(=O)c1cc(nn1C)C(C)(C)C
: