Target
Ornithine decarboxylase
Ligand
BDBM50020273
Substrate
Meas. Tech.
ChEBML_148130
Ki
2700±n/a nM
Citation
 Kendrick, DADanzin, CKolb, M 2,2-Difluoro-5-hexyne-1,4-diamine: a potent enzyme-activated inhibitor of ornithine decarboxylase. J Med Chem 32:170-3 (1989)  
Target
Name:
Ornithine decarboxylase
Synonyms:
DCOR_RAT Odc1
Type:
PROTEIN
Mol. Mass.:
51037.04
Organism:
Rattus norvegicus
Description:
ChEMBL_1344641
Residue:
461
  
Inhibitor
Name:
BDBM50020273
Synonyms:
2,5-Diamino-2-fluoromethyl-pentanoic acid | CHEMBL38759
Type:
Small organic molecule
Emp. Form.:
C6H13FN2O2
Mol. Mass.:
164.178
SMILES:
NCCCC(N)(CF)C(O)=O
: