Target
Ornithine decarboxylase
Ligand
BDBM50020275
Substrate
Meas. Tech.
ChEBML_148130
Ki
3000±n/a nM
Citation
 Kendrick, DADanzin, CKolb, M 2,2-Difluoro-5-hexyne-1,4-diamine: a potent enzyme-activated inhibitor of ornithine decarboxylase. J Med Chem 32:170-3 (1989)  
Target
Name:
Ornithine decarboxylase
Synonyms:
DCOR_RAT Odc1
Type:
PROTEIN
Mol. Mass.:
51037.04
Organism:
Rattus norvegicus
Description:
ChEMBL_1344641
Residue:
461
  
Inhibitor
Name:
BDBM50020275
Synonyms:
CHEMBL413056 | Hept-6-yne-2,5-diamine
Type:
Small organic molecule
Emp. Form.:
C7H14N2
Mol. Mass.:
126.1995
SMILES:
C[C@H](N)CC[C@H](N)C#C
: