Target
Transcription activator BRG1
Ligand
BDBM50453949
Substrate
Meas. Tech.
ChEMBL_1751677 (CHEMBL4186437)
Kd
>10000±n/a nM
Citation
 Lai, KWRomero, FATsui, VBeresini, MHde Leon Boenig, GBronner, SMChen, KChen, ZChoo, EFCrawford, TDCyr, PKaufman, SLi, YLiao, JLiu, WLy, JMurray, JShen, WWai, JWang, FZhu, CZhu, XMagnuson, S Design and synthesis of a biaryl series as inhibitors for the bromodomains of CBP/P300. Bioorg Med Chem Lett 28:15-23 (2018)  
Target
Name:
Transcription activator BRG1
Synonyms:
ATP-dependent helicase SMARCA4 BRG1 Mitotic growth and transcription activator Protein brahma homolog 1 SMCA4_HUMAN SNF2B SWI/SNF-related matrix-associated actin-dependent regulator of chromatin subfamily A member 4
Type:
PROTEIN
Mol. Mass.:
184666.66
Organism:
Homo sapiens (Human)
Description:
ChEMBL_107968
Residue:
1647
  
Inhibitor
Name:
BDBM50453949
Synonyms:
CHEMBL4208820 | US11247989, Example 87
Type:
Small organic molecule
Emp. Form.:
C29H30N6O3
Mol. Mass.:
510.5869
SMILES:
CNC(=O)c1ccc(cn1)-c1cc2cccc(-c3nn(C4CCOCC4)c4CCN(Cc34)C(C)=O)c2cn1
: