Target
Menin
Ligand
BDBM50454121
Substrate
Meas. Tech.
ChEMBL_1752090 (CHEMBL4186850)
IC50
1.000000±n/a nM
Citation
 Wang, ZHLi, DDChen, WLYou, QDGuo, XK Targeting protein-protein interaction between MLL1 and reciprocal proteins for leukemia therapy. Bioorg Med Chem 26:356-365 (2018)  
Target
Name:
Menin
Synonyms:
MEN1 Menin/Histone-lysine N-methyltransferase MLL | SCG2
Type:
Protein
Mol. Mass.:
68022.55
Organism:
Homo sapiens (Human)
Description:
O00255
Residue:
610
  
Inhibitor
Name:
BDBM50454121
Synonyms:
CHEMBL4211366
Type:
Small organic molecule
Emp. Form.:
C22H28N2O2
Mol. Mass.:
352.4699
SMILES:
[H][C@@]12CN(CC(O)CCCc3ccccc3)C[C@@]([H])(C1)n1c(C2)cccc1=O
: