Target
Histone-lysine N-methyltransferase 2A
Ligand
BDBM200723
Substrate
Meas. Tech.
ChEMBL_1752087 (CHEMBL4186847)
Ki
<1.000000±n/a nM
Citation
 Wang, ZHLi, DDChen, WLYou, QDGuo, XK Targeting protein-protein interaction between MLL1 and reciprocal proteins for leukemia therapy. Bioorg Med Chem 26:356-365 (2018)  
Target
Name:
Histone-lysine N-methyltransferase 2A
Synonyms:
ALL-1 ALL1 CXXC-type zinc finger protein 7 HRX Histone-lysine N-methyltransferase 2A KMT2A_HUMAN MLL MLL cleavage product N320 Myeloid/lymphoid or mixed-lineage leukemia Myeloid/lymphoid or mixed-lineage leukemia protein 1 TRX1 Zinc finger protein HRX p320
Type:
Protein
Mol. Mass.:
431905.67
Organism:
Homo sapiens (Human)
Description:
Q03164
Residue:
3969
  
Inhibitor
Name:
BDBM200723
Synonyms:
US9233086, 10L
Type:
Small organic molecule
Emp. Form.:
C35H49F2N7O4
Mol. Mass.:
669.8049
SMILES:
CCC(CC)(NC(=O)C(C)C)C(=O)N[C@@H](CCCNC(N)=N)C(=O)NC1(CCCC1)C(=O)NC(c1ccc(F)cc1)c1ccc(F)cc1
: