Target
cAMP-specific 3',5'-cyclic phosphodiesterase 4D
Ligand
BDBM14774
Substrate
Meas. Tech.
ChEMBL_1754383 (CHEMBL4189143)
IC50
1.1±n/a nM
Citation
 Liao, YGuo, YLi, SWang, LTang, YLi, TChen, WZhong, GSong, G Structure-based design and structure-activity relationships of 1,2,3,4-tetrahydroisoquinoline derivatives as potential PDE4 inhibitors. Bioorg Med Chem Lett 28:1188-1193 (2018)  
Target
Name:
cAMP-specific 3',5'-cyclic phosphodiesterase 4D
Synonyms:
3',5'-cyclic phosphodiesterase PDE43 PDE4D_HUMAN | Phosphodiesterase 4D
Type:
Protein
Mol. Mass.:
91092.69
Organism:
Homo sapiens (Human)
Description:
Q08499
Residue:
809
  
Inhibitor
Name:
BDBM14774
Synonyms:
3-(cyclopropylmethoxy)-N-(3,5-dichloropyridin-4-yl)-4-(difluoromethoxy)benzamide DAXAS Roflumilast
Type:
Small organic molecule
Emp. Form.:
C17H14Cl2F2N2O3
Mol. Mass.:
403.207
SMILES:
FC(F)Oc1ccc(cc1OCC1CC1)C(=O)Nc1c(Cl)cncc1Cl
: