Target
Adenosine receptor A2b
Ligand
BDBM50455533
Substrate
Meas. Tech.
ChEMBL_1754702 (CHEMBL4189462)
Ki
1.3±n/a nM
Citation
 Köse, MGollos, SKarcz, TFiene, AHeisig, FBehrenswerth, AKie?-Kononowicz, KNamasivayam, VMüller, CE Fluorescent-Labeled Selective Adenosine A J Med Chem 61:4301-4316 (2018)  
Target
Name:
Adenosine receptor A2b
Synonyms:
AA2BR_MOUSE Adora2b
Type:
PROTEIN
Mol. Mass.:
36130.09
Organism:
Mus musculus
Description:
ChEMBL_11831
Residue:
332
  
Inhibitor
Name:
BDBM50455533
Synonyms:
CHEMBL4205635
Type:
Small organic molecule
Emp. Form.:
C31H34BF2N7O4
Mol. Mass.:
617.454
SMILES:
CCCn1c(=O)[nH]c2nc([nH]c2c1=O)-c1ccc(OCC(=O)NCCC2=C3C(C)=CC(C)=[N+]3[B-](F)(F)n3c(C)cc(C)c23)cc1
: