Target
Tyrosine-protein kinase Blk
Ligand
BDBM50455738
Substrate
Meas. Tech.
ChEMBL_1754930 (CHEMBL4189690)
IC50
0.200000±n/a nM
Citation
 Xue, YSong, PSong, ZWang, ATong, LGeng, MDing, JLiu, QSun, LXie, HZhang, A Discovery of 4,7-Diamino-5-(4-phenoxyphenyl)-6-methylene-pyrimido[5,4- b]pyrrolizines as Novel Bruton's Tyrosine Kinase Inhibitors. J Med Chem 61:4608-4627 (2018)  
Target
Name:
Tyrosine-protein kinase Blk
Synonyms:
B lymphoid tyrosine kinase BLK_HUMAN Tyrosine-protein kinase BLK (BLK) | p55-Blk
Type:
Protein
Mol. Mass.:
57711.88
Organism:
Homo sapiens (Human)
Description:
P51451
Residue:
505
  
Inhibitor
Name:
BDBM50455738
Synonyms:
CHEMBL4211949
Type:
Small organic molecule
Emp. Form.:
C25H21N5O2
Mol. Mass.:
423.4665
SMILES:
Nc1ncnc2n3C[C@@H](NC(=O)C=C)C(=C)c3c(-c3ccc(Oc4ccccc4)cc3)c12
: