Target
Envelope glycoprotein
Ligand
BDBM77970
Substrate
Meas. Tech.
ChEMBL_1755048 (CHEMBL4189808)
Kd
118000±n/a nM
Citation
 Zhao, YRen, JFry, EEXiao, JTownsend, ARStuart, DI Structures of Ebola Virus Glycoprotein Complexes with Tricyclic Antidepressant and Antipsychotic Drugs. J Med Chem 61:4938-4945 (2018)  
Target
Name:
Envelope glycoprotein
Synonyms:
Envelope glycoprotein GP1 GP1,2-delta Shed GP | VGP_EBOZM
Type:
PROTEIN
Mol. Mass.:
74464.56
Organism:
Zaire ebolavirus (strain Mayinga-76) (ZEBOV) (Zaire Ebola virus)
Description:
ChEMBL_117434
Residue:
676
  
Inhibitor
Name:
BDBM77970
Synonyms:
3-(2-chloranyl-5,6-dihydrobenzo[b][1]benzazepin-11-yl)-N,N-dimethyl-propan-1-amine;hydrochloride 3-(2-chloro-5,6-dihydrobenzo[b][1]benzazepin-11-yl)-N,N-dimethylpropan-1-amine;hydrochloride CHLORIMIPRAMINE CLOMIPRAMINE HYDROCHLORIDE MLS000028511 cid_68539 | med.21724, Compound Clomipramine
Type:
Small organic molecule
Emp. Form.:
C19H23ClN2
Mol. Mass.:
314.852
SMILES:
CN(C)CCCN1c2ccccc2CCc2ccc(Cl)cc12
: