Target
Envelope glycoprotein
Ligand
BDBM50010859
Substrate
Meas. Tech.
ChEMBL_1755048 (CHEMBL4189808)
Kd
584000±n/a nM
Citation
 Zhao, YRen, JFry, EEXiao, JTownsend, ARStuart, DI Structures of Ebola Virus Glycoprotein Complexes with Tricyclic Antidepressant and Antipsychotic Drugs. J Med Chem 61:4938-4945 (2018)  
Target
Name:
Envelope glycoprotein
Synonyms:
Envelope glycoprotein GP1 GP1,2-delta Shed GP | VGP_EBOZM
Type:
PROTEIN
Mol. Mass.:
74464.56
Organism:
Zaire ebolavirus (strain Mayinga-76) (ZEBOV) (Zaire Ebola virus)
Description:
ChEMBL_117434
Residue:
676
  
Inhibitor
Name:
BDBM50010859
Synonyms:
CHEMBL11 IMIPRAMINE PAMOATE | Imipramin
Type:
Small organic molecule
Emp. Form.:
C19H24N2
Mol. Mass.:
280.4073
SMILES:
CN(C)CCCN1c2ccccc2CCc2ccccc12
: