Target
Adenosine receptor A2a/A2b
Ligand
BDBM50021086
Substrate
Meas. Tech.
ChEMBL_27751 (CHEMBL641987)
Ki
470±n/a nM
Citation
 Jacobson, KAKirk, KLPadgett, WLDaly, JW Functionalized congeners of 1,3-dialkylxanthines: preparation of analogues with high affinity for adenosine receptors. J Med Chem 28:1334-40 (1985)  
Target
Name:
Adenosine receptor A2a/A2b
Synonyms:
Adenosine A2 receptor
Type:
Mol. Mass.:
Description:
ASSAY_ID of ChEMBL is 329906
Components:
This complex has 2 components.
Component 1
Name:
Adenosine receptor A2b
Synonyms:
AA2BR_HUMAN ADORA2B Adenosine receptors A2b | Adenosine receptors; A2a & A2b
Type:
G Protein-Coupled Receptor (GPCR)
Mol. Mass.:
36341.22
Organism:
Homo sapiens (Human)
Description:
Residue:
332
  
Component 2
Name:
Adenosine receptor A2a
Synonyms:
A2A adenosine receptor (hA2A) ADENOSINE A2 ADORA2 Adenosine A2A receptor (A2AAR)
Type:
G Protein-Coupled Receptor (GPCR)
Mol. Mass.:
44716.46
Organism:
Homo sapiens (Human)
Description:
P29274
Residue:
412
  
Inhibitor
Name:
BDBM50021086
Synonyms:
CHEMBL422937 | N-(8-Amino-octyl)-2-[4-(2,6-dioxo-1,3-dipropyl-2,3,6,9-tetrahydro-1H-purin-8-yl)-phenoxy]-acetamide
Type:
Small organic molecule
Emp. Form.:
C27H40N6O4
Mol. Mass.:
512.6443
SMILES:
CCCn1c2[nH]c(nc2c(=O)n(CCC)c1=O)-c1ccc(OCC(=O)NCCCCCCCCN)cc1
: