Target
Angiotensin-converting enzyme
Ligand
BDBM50021115
Substrate
Meas. Tech.
ChEMBL_34927 (CHEMBL647672)
Ki
18±n/a nM
Citation
 Galardy, REGrobelny, D N alpha-(diphenoxyphosphoryl)-L-alanyl-L-proline, N alpha-[bis (4-nitrophenoxy)phosphoryl]-L-alanyl-L-proline, and N alpha-[ (2-phenylethyl)phenoxyphosphoryl]-L-alanyl-L-proline: releasers of potent inhibitors of angiotensin converting enzyme at physiological pH and temperature. J Med Chem 28:1422-7 (1985)  
Target
Name:
Angiotensin-converting enzyme
Synonyms:
3.2.1.- ACE Angiotensin-converting enzyme, soluble form DCP1 Kininase II
Type:
Mol. Mass.:
150405.15
Organism:
Oryctolagus cuniculus
Description:
Residue:
1310
  
Inhibitor
Name:
BDBM50021115
Synonyms:
CHEMBL33325 | disodium (2S)-1-((2S)-2-{[(4-nitrophenoxy)phosphinato]amino}propanoyl)pyrrolidine-2-carboxylate
Type:
Small organic molecule
Emp. Form.:
C14H16N3O8P
Mol. Mass.:
385.267
SMILES:
C[C@H](NP([O-])(=O)Oc1ccc(cc1)[N+]([O-])=O)C(=O)N1CCC[C@H]1C([O-])=O
: