Target
Serine/threonine-protein kinase ATR
Ligand
BDBM50456368
Substrate
Meas. Tech.
ChEMBL_1755827 (CHEMBL4190835)
IC50
2630±n/a nM
Citation
 Ramachandran, SAJadhavar, PSSingh, MPSharma, ABagle, GNQuinn, KPWong, PYProtter, AARai, RPham, SMLindquist, JN Discovery of pyrazolopyrimidine derivatives as novel inhibitors of ataxia telangiectasia and rad3 related protein (ATR). Bioorg Med Chem Lett 27:750-754 (2017)  
Target
Name:
Serine/threonine-protein kinase ATR
Synonyms:
ATR Ataxia telangiectasia and Rad3-related protein (ATR) FRP1 | Serine-protein kinase ATR
Type:
Protein
Mol. Mass.:
301404.58
Organism:
Homo sapiens (Human)
Description:
Q13535
Residue:
2644
  
Inhibitor
Name:
BDBM50456368
Synonyms:
CHEMBL4216036
Type:
Small organic molecule
Emp. Form.:
C20H17FN8S
Mol. Mass.:
420.466
SMILES:
Nc1nc2CCC(Cc2s1)n1nc(-c2cc(F)c3[nH]ccc3c2)c2c(N)ncnc12
: