Target
Phosphatidylinositol 4,5-bisphosphate 3-kinase catalytic subunit delta isoform
Ligand
BDBM50456368
Substrate
Meas. Tech.
ChEMBL_1755829 (CHEMBL4190837)
IC50
307±n/a nM
Citation
 Ramachandran, SAJadhavar, PSSingh, MPSharma, ABagle, GNQuinn, KPWong, PYProtter, AARai, RPham, SMLindquist, JN Discovery of pyrazolopyrimidine derivatives as novel inhibitors of ataxia telangiectasia and rad3 related protein (ATR). Bioorg Med Chem Lett 27:750-754 (2017)  
Target
Name:
Phosphatidylinositol 4,5-bisphosphate 3-kinase catalytic subunit delta isoform
Synonyms:
PI3-kinase p110 subunit delta PI3-kinase subunit p110-delta PIK3CD Phosphatidylinositol 4,5-biphosphate 3-kinase catalytic subunit delta (PIK3CD) Phosphatidylinositol 4,5-bisphosphate 3-kinase 110 kDa catalytic subunit delta (PI3K delta) Phosphatidylinositol 4,5-bisphosphate 3-kinase catalytic subunit delta (PI3Kdelta) Phosphatidylinositol 4,5-bisphosphate 3-kinase catalytic subunit delta isoform (PI3K delta) Phosphatidylinositol 4,5-bisphosphate 3-kinase catalytic subunit delta isoform (PI3K-delta) Phosphatidylinositol 4,5-bisphosphate 3-kinase catalytic subunit delta isoform (PI3Kdelta)
Type:
Enzyme Subunit
Mol. Mass.:
119489.41
Organism:
Homo sapiens (Human)
Description:
O00329
Residue:
1044
  
Inhibitor
Name:
BDBM50456368
Synonyms:
CHEMBL4216036
Type:
Small organic molecule
Emp. Form.:
C20H17FN8S
Mol. Mass.:
420.466
SMILES:
Nc1nc2CCC(Cc2s1)n1nc(-c2cc(F)c3[nH]ccc3c2)c2c(N)ncnc12
: