Target
Tyrosine-protein kinase BTK
Ligand
BDBM50456370
Substrate
Meas. Tech.
ChEMBL_1755828 (CHEMBL4190836)
IC50
123±n/a nM
Citation
 Ramachandran, SAJadhavar, PSSingh, MPSharma, ABagle, GNQuinn, KPWong, PYProtter, AARai, RPham, SMLindquist, JN Discovery of pyrazolopyrimidine derivatives as novel inhibitors of ataxia telangiectasia and rad3 related protein (ATR). Bioorg Med Chem Lett 27:750-754 (2017)  
Target
Name:
Tyrosine-protein kinase BTK
Synonyms:
AGMX1 Agammaglobulinaemia tyrosine kinase B cell progenitor kinase BPK BTK_HUMAN Tyrosine Kinase BTK Tyrosine-protein kinase BTK (BTK)
Type:
Enzyme
Mol. Mass.:
76289.95
Organism:
Homo sapiens (Human)
Description:
Q06187
Residue:
659
  
Inhibitor
Name:
BDBM50456370
Synonyms:
CHEMBL4211185
Type:
Small organic molecule
Emp. Form.:
C20H16BrN5O
Mol. Mass.:
422.278
SMILES:
Nc1ncnc2n(nc(-c3ccc(Br)c(O)c3)c12)C1CCc2ccccc12
: