Target
Serine/threonine-protein kinase ATR
Ligand
BDBM50456378
Substrate
Meas. Tech.
ChEMBL_1755827 (CHEMBL4190835)
IC50
1590±n/a nM
Citation
 Ramachandran, SAJadhavar, PSSingh, MPSharma, ABagle, GNQuinn, KPWong, PYProtter, AARai, RPham, SMLindquist, JN Discovery of pyrazolopyrimidine derivatives as novel inhibitors of ataxia telangiectasia and rad3 related protein (ATR). Bioorg Med Chem Lett 27:750-754 (2017)  
Target
Name:
Serine/threonine-protein kinase ATR
Synonyms:
ATR Ataxia telangiectasia and Rad3-related protein (ATR) FRP1 | Serine-protein kinase ATR
Type:
Protein
Mol. Mass.:
301404.58
Organism:
Homo sapiens (Human)
Description:
Q13535
Residue:
2644
  
Inhibitor
Name:
BDBM50456378
Synonyms:
CHEMBL4209086
Type:
Small organic molecule
Emp. Form.:
C23H20N6
Mol. Mass.:
380.4451
SMILES:
Nc1ncnc2n(nc(-c3ccc4[nH]ccc4c3)c12)C1CCc2ccccc2C1
: