Target
Acetylcholinesterase
Ligand
BDBM50456710
Substrate
Meas. Tech.
ChEMBL_1757787 (CHEMBL4192795)
Ki
7.6±n/a nM
Citation
 Roldán-Peña, JMAlejandre-Ramos, DLópez, ÓMaya, ILagunes, IPadrón, JMPeña-Altamira, LEBartolini, MMonti, BBolognesi, MLFernández-Bolaños, JG New tacrine dimers with antioxidant linkers as dual drugs: Anti-Alzheimer's and antiproliferative agents. Eur J Med Chem 138:761-773 (2017)  
Target
Name:
Acetylcholinesterase
Synonyms:
ACES_ELEEL Acetylcholinesterase (EeAChE) | ache
Type:
Enzyme
Mol. Mass.:
71812.79
Organism:
Electrophorus electricus (Electric eel)
Description:
Residue:
633
  
Inhibitor
Name:
BDBM50456710
Synonyms:
CHEMBL4213722
Type:
Small organic molecule
Emp. Form.:
C27H34N4Se
Mol. Mass.:
493.55
SMILES:
[#6]-c1ccc(-[#7]-[#6](=[Se;v2])-[#7]-[#6]-[#6]-[#6]-[#6]-[#6]-[#6]-[#7]-c2c3-[#6]-[#6]-[#6]-[#6]-c3nc3ccccc23)cc1
: