Target
Angiotensin-converting enzyme
Ligand
BDBM50021335
Substrate
Meas. Tech.
ChEMBL_34784 (CHEMBL643761)
IC50
>100000±n/a nM
Citation
 Skiles, JWSuh, JTWilliams, BEMenard, PRBarton, JNLoev, BJones, HNeiss, ESSchwab, AMann, WS Angiotensin-converting enzyme inhibitors: new orally active 1,4-thiazepine-2,5-diones, 1,4-thiazine-2,5-diones, and 1,4-benzothiazepine-2,5-diones possessing antihypertensive activity. J Med Chem 29:784-96 (1986)  
Target
Name:
Angiotensin-converting enzyme
Synonyms:
3.2.1.- ACE Angiotensin-converting enzyme, soluble form DCP1 Kininase II
Type:
Mol. Mass.:
150405.15
Organism:
Oryctolagus cuniculus
Description:
Residue:
1310
  
Inhibitor
Name:
BDBM50021335
Synonyms:
3-(2-Acetylsulfanyl-propionyl)-2,2,5,5-tetramethyl-thiazolidine-4-carboxylic acid | CHEMBL165930
Type:
Small organic molecule
Emp. Form.:
C13H21NO4S2
Mol. Mass.:
319.44
SMILES:
CC(SC(C)=O)C(=O)N1C(C(O)=O)C(C)(C)SC1(C)C
: