Target
Genome polyprotein
Ligand
BDBM50457109
Substrate
Meas. Tech.
ChEMBL_1758772 (CHEMBL4193780)
EC50
12±n/a nM
Citation
 Li, PYu, JHao, FHe, HShi, XHu, JWang, LDu, CZhang, XSun, YLin, FGu, ZXu, DChen, XShen, LHu, GLi, JChen, SXiao, WWang, ZGuo, QChang, XTian, XLin, T Discovery of Potent EV71 Capsid Inhibitors for Treatment of HFMD. ACS Med Chem Lett 8:841-846 (2017)  
Target
Name:
Genome polyprotein
Synonyms:
2.7.7.48 3.4.22.29 3D polymerase Capsid protein VP0 Capsid protein VP2 Capsid protein VP4 P1A P1C P2A P2C P3B POLG_HE71B Protease 2A Protein 2A Protein 2C Protein 3AB Protein 3CD RNA-directed RNA polymerase VP4-VP2 Viral protein genome-linked Virion protein 2 Virion protein 4
Type:
PROTEIN
Mol. Mass.:
242858.59
Organism:
Human enterovirus 71 (strain BrCr) (Ev 71)
Description:
ChEMBL_117851
Residue:
2193
  
Inhibitor
Name:
BDBM50457109
Synonyms:
CHEMBL4203068
Type:
Small organic molecule
Emp. Form.:
C24H27ClN4O3S
Mol. Mass.:
487.014
SMILES:
Nc1cc(ccn1)N1CCN(CCCCCOc2ccc(cc2)-c2ccc(Cl)cc2)S1(=O)=O
: