Target
Lysine-specific demethylase 4C
Ligand
BDBM293660
Substrate
Meas. Tech.
ChEMBL_1758840 (CHEMBL4193848)
IC50
9.0±n/a nM
Citation
 Chen, YKBonaldi, TCuomo, ADel Rosario, JRHosfield, DJKanouni, TKao, SCLai, CLobo, NAMatuszkiewicz, JMcGeehan, AO'Connell, SMShi, LStafford, JAStansfield, RKVeal, JMWeiss, MSYuen, NYWallace, MB Design of KDM4 Inhibitors with Antiproliferative Effects in Cancer Models. ACS Med Chem Lett 8:869-874 (2017)  
Target
Name:
Lysine-specific demethylase 4C
Synonyms:
GASC-1 protein Gene amplified in squamous cell carcinoma 1 protein JMJD2C Jumonji domain-containing protein 2C KDM4C_HUMAN | KIAA0780
Type:
Protein
Mol. Mass.:
119979.01
Organism:
Homo sapiens (Human)
Description:
Q9H3R0
Residue:
1056
  
Inhibitor
Name:
BDBM293660
Synonyms:
3-({[(1S)-6-[methyl(phenyl)amino]-1,2,3,4-tetrahydronaphthalen-1- | US10106534, Example 2
Type:
Small organic molecule
Emp. Form.:
C24H25N3O2
Mol. Mass.:
387.4742
SMILES:
CN(c1ccccc1)c1ccc2[C@H](CNc3cnccc3C(O)=O)CCCc2c1
: