Target
Lysine-specific demethylase 4C
Ligand
BDBM50457157
Substrate
Meas. Tech.
ChEMBL_1758830 (CHEMBL4193838)
IC50
48±n/a nM
Citation
 Chen, YKBonaldi, TCuomo, ADel Rosario, JRHosfield, DJKanouni, TKao, SCLai, CLobo, NAMatuszkiewicz, JMcGeehan, AO'Connell, SMShi, LStafford, JAStansfield, RKVeal, JMWeiss, MSYuen, NYWallace, MB Design of KDM4 Inhibitors with Antiproliferative Effects in Cancer Models. ACS Med Chem Lett 8:869-874 (2017)  
Target
Name:
Lysine-specific demethylase 4C
Synonyms:
GASC-1 protein Gene amplified in squamous cell carcinoma 1 protein JMJD2C Jumonji domain-containing protein 2C KDM4C_HUMAN | KIAA0780
Type:
Protein
Mol. Mass.:
119979.01
Organism:
Homo sapiens (Human)
Description:
Q9H3R0
Residue:
1056
  
Inhibitor
Name:
BDBM50457157
Synonyms:
CHEMBL4216399
Type:
Small organic molecule
Emp. Form.:
C23H22N2O2S
Mol. Mass.:
390.498
SMILES:
OC(=O)c1ccncc1NC[C@@H]1CCCc2cc(Sc3ccccc3)ccc12
: