Target
Phosphatidylinositol 4,5-bisphosphate 3-kinase catalytic subunit gamma isoform
Ligand
BDBM50457170
Substrate
Meas. Tech.
ChEMBL_1758863 (CHEMBL4193871)
IC50
0.700000±n/a nM
Citation
 Yang, CZhang, XWang, YYang, YLiu, XDeng, MJia, YLing, YMeng, LHZhou, Y Discovery of a Novel Series of 7-Azaindole Scaffold Derivatives as PI3K Inhibitors with Potent Activity. ACS Med Chem Lett 8:875-880 (2017)  
Target
Name:
Phosphatidylinositol 4,5-bisphosphate 3-kinase catalytic subunit gamma isoform
Synonyms:
PI3-kinase p110 subunit gamma PI3Kgamma PK3CG_HUMAN Phosphatidylinositol 4,5-bisphosphate 3-kinase (PI3K) Phosphatidylinositol 4,5-bisphosphate 3-kinase catalytic subunit gamma (PI3Kgamma) Phosphatidylinositol 4,5-bisphosphate 3-kinase catalytic subunit gamma isoform (PI3K) Phosphatidylinositol-4,5-bisphosphate 3-kinase catalytic subunit gamma isoform Phosphoinositide 3-kinases gamma (PI3K gamma) p120-PI3K
Type:
Enzyme Subunit
Mol. Mass.:
126470.30
Organism:
Homo sapiens (Human)
Description:
P48736
Residue:
1102
  
Inhibitor
Name:
BDBM50457170
Synonyms:
CHEMBL4208385
Type:
Small organic molecule
Emp. Form.:
C23H15ClFN5O2S
Mol. Mass.:
479.914
SMILES:
Fc1ccc(cc1)S(=O)(=O)Nc1cc(cnc1Cl)-c1cnc2[nH]cc(-c3ccncc3)c2c1
: