Target
Histone deacetylase
Ligand
BDBM50457639
Substrate
Meas. Tech.
ChEMBL_1760362 (CHEMBL4195370)
IC50
>20000±n/a nM
Citation
 Zang, JLiang, XHuang, YJia, YLi, XXu, WChou, CJZhang, Y Discovery of Novel Pazopanib-Based HDAC and VEGFR Dual Inhibitors Targeting Cancer Epigenetics and Angiogenesis Simultaneously. J Med Chem 61:5304-5322 (2018)  
Target
Name:
Histone deacetylase
Synonyms:
Histone deacetylase 1/2/3/4/5/6/7/8/9/11/Polyamine deacetylase HDAC10
Type:
Mol. Mass.:
Description:
ASSAY_ID of ChEMBL is 2184250
Components:
This complex has 11 components.
Component 1
Name:
Histone deacetylase 1
Synonyms:
Cereblon/Histone deacetylase 1 HDAC1 Histone deacetylase 1 (HDAC1) RPD3L1
Type:
Enzyme
Mol. Mass.:
55090.27
Organism:
Homo sapiens (Human)
Description:
Q13547
Residue:
482
  
Component 2
Name:
Histone deacetylase 3
Synonyms:
HD3 HDAC3_HUMAN Human HDAC3 SMAP45
Type:
Enzyme
Mol. Mass.:
48829.55
Organism:
Homo sapiens (Human)
Description:
O15379
Residue:
428
  
Component 3
Name:
Histone deacetylase 6
Synonyms:
Cereblon/Histone deacetylase 6 HDAC6 Histone deacetylase 6 (HDAC6) KIAA0901 | ORF Names:JM21
Type:
Chromatin regulator; hydrolase; repressor
Mol. Mass.:
131381.51
Organism:
Homo sapiens (Human)
Description:
Q9UBN7
Residue:
1215
  
Component 4
Name:
Histone deacetylase 2
Synonyms:
Cereblon/Histone deacetylase 2 HDAC2 Histone deacetylase 2 (HDAC2) | Human HDAC2
Type:
Chromatin regulator; hydrolase; repressor
Mol. Mass.:
55356.54
Organism:
Homo sapiens (Human)
Description:
Q92769
Residue:
488
  
Component 5
Name:
Histone deacetylase 5
Synonyms:
Antigen NY-CO-9 HDAC5 Histone acetylase 5 (HDAC5) Human HDAC5 | KIAA0600
Type:
Enzyme
Mol. Mass.:
121968.61
Organism:
Homo sapiens (Human)
Description:
Q9UQL6
Residue:
1122
  
Component 6
Name:
Histone deacetylase 7
Synonyms:
HD7 HDAC7A Histone acetylase 7 (HDAC7) Human HDAC7
Type:
Chromatin regulator; hydrolase; repressor
Mol. Mass.:
102942.62
Organism:
Homo sapiens (Human)
Description:
Q8WUI4
Residue:
952
  
Component 7
Name:
Histone deacetylase 8
Synonyms:
HD8 HDAC8_HUMAN Histone deacetylase 8 (HDAC-8) | Human HDAC8
Type:
Enzyme
Mol. Mass.:
41749.60
Organism:
Homo sapiens (Human)
Description:
Q9BY41
Residue:
377
  
Component 8
Name:
Histone deacetylase 11
Synonyms:
HD11 HDAC11 | Human HDAC11
Type:
Chromatin regulator; hydrolase; repressor
Mol. Mass.:
39187.66
Organism:
Homo sapiens (Human)
Description:
Q96DB2
Residue:
347
  
Component 9
Name:
Histone deacetylase 4
Synonyms:
Cereblon/Histone deacetylase 4 HDAC4 Histone acetylase 4(HDAC4) KIAA0288
Type:
Enzyme
Mol. Mass.:
119049.39
Organism:
Homo sapiens (Human)
Description:
P56524
Residue:
1084
  
Component 10
Name:
Histone deacetylase 9
Synonyms:
HD9 HDAC7B HDAC9_HUMAN Histone acetylase 9 (HDAC9) Histone deacetylase 9 (HDAC9) Human HDAC9 MITR
Type:
Enzyme
Mol. Mass.:
111304.31
Organism:
Homo sapiens (Human)
Description:
Q9UKV0
Residue:
1011
  
Component 11
Name:
Polyamine deacetylase HDAC10
Synonyms:
HD10 HDAC10 Histone deacetylase 10 | Human HDAC10
Type:
Chromatin regulator; hydrolase; repressor
Mol. Mass.:
71431.89
Organism:
Homo sapiens (Human)
Description:
Q969S8
Residue:
669
  
Inhibitor
Name:
BDBM50457639
Synonyms:
CHEMBL4208421
Type:
Small organic molecule
Emp. Form.:
C22H23N7O2
Mol. Mass.:
417.4637
SMILES:
CN(c1ccc2c(C)n(C)nc2c1)c1ccnc(Nc2ccc(C)c(c2)C(=O)NO)n1
: