Target
5-hydroxytryptamine receptor 1A
Ligand
BDBM50457769
Substrate
Meas. Tech.
ChEMBL_1760593 (CHEMBL4195601)
Ki
13790±n/a nM
Citation
 Kelemen, ÁASata?a, GBojarski, AJKeser?, GM Spiro[pyrrolidine-3,3'-oxindoles] as 5-HT Bioorg Med Chem Lett 28:2418-2421 (2018)  
Target
Name:
5-hydroxytryptamine receptor 1A
Synonyms:
5-HT-1A 5-hydroxytryptamine receptor 1A (5-HT-1A) ADRB2RL1 Dopamine D2 receptor and serotonin 1a receptor HTR1A | Serotonin receptor 1A
Type:
Mol. Mass.:
46122.49
Organism:
Homo sapiens (Human)
Description:
Residue:
422
  
Inhibitor
Name:
BDBM50457769
Synonyms:
CHEMBL4208468
Type:
Small organic molecule
Emp. Form.:
C24H28ClN3O2
Mol. Mass.:
425.951
SMILES:
Clc1ccc(OC2CCN(CCN3CCC4(C3)C(=O)Nc3ccccc43)CC2)cc1
: